{"text_format":"3","workbook":"xlsx","n_sheets":3,"sheets":["Firm","Firm_ori","Sheet1"],"not_rendered":{"external_links":1},"read":"whole","date_system":"1900"}

{"sheet":"Firm","index":0,"n_rows":172,"n_cols":120,"rows_kept":172}
["Code","Name","Stock_Region","Stock_Name","Stock_Code","Chinese_Name","Report_Year","Assets","Revenue","Size","Num_Employ","Source","Type_Region",1,1.1,"1.1.1","1.1.2","1.1.3",1.2,"1.2.1","1.2.2","1.2.3",1.3,"1.3.1","1.3.1.1","1.3.1.2","1.3.1.3","1.3.1.4","1.3.1.5","1.3.1.6","1.3.1.7","1.3.2","1.3.2.1","1.3.3","1.3.3.1","1.3.3.2","1.3.3.3","1.3.3.4","1.3.3.5","1.3.3.6","1.3.3.7","1.3.4","1.3.4.1","1.3.4.2","1.3.4.3","1.3.5","1.3.5.1",1.4,"1.4.1","1.4.1.1","1.4.1.2","1.4.1.3","1.4.1.4","1.4.1.5","1.4.2","1.4.2.1","1.4.2.2","1.4.2.3","1.4.2.4","1.4.2.5","1.4.2.6","1.4.2.7","1.4.3","1.4.3.1","1.4.3.2","1.4.3.3","1.4.3.4","1.4.3.5","1.4.3.6","1.4.4","1.4.4.1","1.4.4.2","1.4.4.3","1.4.4.4","1.4.4.5","1.4.5","1.4.5.1","1.4.5.2","1.4.5.3","1.4.5.4","1.4.5.5","1.4.5.6","1.4.5.7","1.4.5.8","1.4.5.9",2,2.1,"2.1.1","2.1.1.1","2.1.1.2","2.1.1.3","2.1.1.4","2.1.1.5","2.1.2","2.1.2.1","2.1.2.2","2.1.2.3","2.1.2.4","2.1.3","2.1.3.1","2.1.3.2","2.1.3.3","2.1.3.4","2.1.3.5","2.1.3.6","2.1.3.7","2.1.4","2.1.4.1","2.1.4.1.1","2.1.4.1.2","2.1.4.1.3","2.1.4.1.4","2.1.4.2","2.1.4.2.1","2.1.4.2.2",2.2,2.3,"2.3.1","2.3.2","2.3.3"]
[0,"360科技","SH","三六零",{"$f":"VLOOKUP($D2,[1]Sheet1!$A$1:$M$5087,2,FALSE)","v":"601360.SH"},{"$f":"VLOOKUP($D2,[1]Sheet1!$A$1:$M$5087,9,FALSE)","v":"三六零安全科技股份有限公司"},2021,{"v":42040000000,"d":"42040000000.00"},{"v":10890000000,"d":"10890000000.00"},"L",{"v":7393,"d":"7393.00"},"qichacha","Beijing",{"$nulls":57},{"v":1,"d":"1.00"}]
[1,"51WORLD",null,"51WORLD",null,"北京五一视界数字孪生科技股份有限公司",2021,{"v":524000000,"d":"524000000.00"},{"v":138000000,"d":"138000000.00"},"M",{"v":171,"d":"171.00"},"qichacha","Beijing",{"$nulls":79},{"v":1,"d":"1.00"}]
[2,"706所",null,"706所",null,"北京航天爱威电子技术有限公司",{"$nulls":3},"M",{"v":113,"d":"113.00"},"qichacha","Beijing",{"$nulls":4},{"v":1,"d":"1.00"}]
[3,"艾克斯特",null,"艾克斯特",null,"北京艾克斯特科技有限公司",{"$nulls":3},"S",{"v":24,"d":"24.00"},"qichacha","Beijing",{"$nulls":14},{"v":1,"d":"1.00"},{"v":1,"d":"1.00"},{"v":1,"d":"1.00"},{"$nulls":12},{"v":1,"d":"1.00"}]
[4,"爱创科技",null,"爱创科技",null,"北京爱创科技股份有限公司",{"$nulls":3},"M",{"v":242,"d":"242.00"},"qichacha","Beijing",{"$nulls":7},{"v":1,"d":"1.00"}]
[5,"安华金和",null,"安华金和",null,"北京安华金和科技有限公司",{"$nulls":3},"S",{"v":74,"d":"74.00"},"qichacha","Beijing",{"$nulls":65},{"v":1,"d":"1.00"},{"v":1,"d":"1.00"},{"v":1,"d":"1.00"},{"$nulls":3},{"v":1,"d":"1.00"}]
[6,"安世亚太",null,"安世亚太",null,"安世亚太科技股份有限公司",2017,{"v":902000000,"d":"902000000.00"},{"v":159000000,"d":"159000000.00"},"M",{"v":167,"d":"167.00"},"qichacha","Beijing",{"$nulls":12},{"v":1,"d":"1.00"},{"$nulls":68},{"v":1,"d":"1.00"},{"v":1,"d":"1.00"},{"v":1,"d":"1.00"},{"v":1,"d":"1.00"}]
[7,"百望",null,"百望",null,"百望股份有限公司",{"$nulls":3},"L",{"v":436,"d":"436.00"},"qichacha","Beijing",{"$nulls":102},{"v":1,"d":"1.00"}]
[8,"梆梆安全",null,"梆梆安全",null,"北京梆梆安全科技有限公司",{"$nulls":3},"M",{"v":353,"d":"353.00"},"qichacha","Beijing",{"$nulls":36},{"v":1,"d":"1.00"}]
[9,"北京航天测控",null,"北京航天测控",null,"北京航天测控技术有限公司",{"$nulls":3},"L",{"v":392,"d":"392.00"},"qichacha","Beijing",{"$nulls":26},{"v":1,"d":"1.00"},{"v":1,"d":"1.00"}]
[10,"北京英贝思",null,"北京英贝思",null,"北京京能信息技术有限公司",{"$nulls":3},"M",{"v":123,"d":"123.00"},"qichacha","Beijing",{"$nulls":25},{"v":1,"d":"1.00"}]
[11,"北信源","SZ","北信源",{"$f":"VLOOKUP($D13,[1]Sheet1!$A$1:$M$5087,2,FALSE)","v":"300352.SZ"},{"$f":"VLOOKUP($D13,[1]Sheet1!$A$1:$M$5087,9,FALSE)","v":"北京北信源软件股份有限公司"},2021,{"v":2831000000,"d":"2831000000.00"},{"v":675000000,"d":"675000000.00"},"L",{"v":1699,"d":"1699.00"},"qichacha","Beijing",{"$nulls":58},{"v":1,"d":"1.00"}]
[12,"大唐软件",null,"大唐软件",null,"大唐软件技术股份有限公司",{"$nulls":3},"M",{"v":199,"d":"199.00"},"qichacha","Beijing",{"$nulls":6},{"v":1,"d":"1.00"}]
[13,"东方国信","SZ","东方国信",{"$f":"VLOOKUP($D15,[1]Sheet1!$A$1:$M$5087,2,FALSE)","v":"300166.SZ"},{"$f":"VLOOKUP($D15,[1]Sheet1!$A$1:$M$5087,9,FALSE)","v":"北京东方国信科技股份有限公司"},2021,{"v":8632000000,"d":"8632000000.00"},{"v":2470000000,"d":"2470000000.00"},"L",{"v":8688,"d":"8688.00"},"qichacha","Beijing",{"$nulls":7},{"v":1,"d":"1.00"},{"$nulls":78},{"v":1,"d":"1.00"},{"v":1,"d":"1.00"},{"v":1,"d":"1.00"},{"v":1,"d":"1.00"},{"v":1,"d":"1.00"},{"v":1,"d":"1.00"},{"v":1,"d":"1.00"},null,null,{"v":1,"d":"1.00"},{"v":1,"d":"1.00"},{"v":1,"d":"1.00"},{"v":1,"d":"1.00"},null,{"v":1,"d":"1.00"},{"v":1,"d":"1.00"},null,null,{"v":1,"d":"1.00"},{"v":1,"d":"1.00"},{"v":1,"d":"1.00"}]
[14,"东华软件","SZ","东华软件",{"$f":"VLOOKUP($D16,[1]Sheet1!$A$1:$M$5087,2,FALSE)","v":"002065.SZ"},{"$f":"VLOOKUP($D16,[1]Sheet1!$A$1:$M$5087,9,FALSE)","v":"东华软件股份公司"},2021,{"v":21070000000,"d":"21070000000.00"},{"v":10880000000,"d":"10880000000.00"},"L",{"v":11766,"d":"11766.00"},"qichacha","Beijing",{"$nulls":24},{"v":1,"d":"1.00"},{"$nulls":6},{"v":1,"d":"1.00"}]
[15,"东软集团","SH","东软集团",{"$f":"VLOOKUP($D17,[1]Sheet1!$A$1:$M$5087,2,FALSE)","v":"600718.SH"},{"$f":"VLOOKUP($D17,[1]Sheet1!$A$1:$M$5087,9,FALSE)","v":"东软集团股份有限公司"},2021,{"v":18310000000,"d":"18310000000.00"},{"v":8735000000,"d":"8735000000.00"},"L",{"v":17919,"d":"17919.00"},"qichacha","Beijing",{"$nulls":25},{"v":1,"d":"1.00"}]
[16,"东土科技","SZ","东土科技",{"$f":"VLOOKUP($D18,[1]Sheet1!$A$1:$M$5087,2,FALSE)","v":"300353.SZ"},{"$f":"VLOOKUP($D18,[1]Sheet1!$A$1:$M$5087,9,FALSE)","v":"北京东土科技股份有限公司"},2021,{"v":2357000000,"d":"2357000000.00"},{"v":941000000,"d":"941000000.00"},"L",{"v":1633,"d":"1633.00"},"qichacha","Beijing",{"$nulls":4},{"v":1,"d":"1.00"},{"$nulls":99},{"v":1,"d":"1.00"},{"v":1,"d":"1.00"},{"v":1,"d":"1.00"}]
[17,"国保金泰",null,"国保金泰",null,"北京国保金泰信息安全技术有限公司",{"$nulls":3},"S",{"v":32,"d":"32.00"},"qichacha","Beijing",{"$nulls":45},{"v":1,"d":"1.00"}]
[18,"国能智深",null,"国能智深",null,"国能智深控制技术有限公司",{"$nulls":3},"M",{"v":277,"d":"277.00"},"qichacha","Beijing",{"$nulls":22},{"v":1,"d":"1.00"}]
[19,"国泰网信",null,"国泰网信",null,"北京国泰网信科技有限公司",{"$nulls":3},"S",{"v":54,"d":"54.00"},"qichacha","Beijing",{"$nulls":42},{"v":1,"d":"1.00"}]
[20,"海基科技",null,"海基科技",null,"北京海基科技发展有限责任公司",{"$nulls":3},"XS",{"v":8,"d":"8.00"},"qichacha","Beijing",{"$nulls":12},{"v":1,"d":"1.00"}]
[21,"Hexagon","SE","Hexagon","HEXA.B","Hexagon AB",2021,{"v":4348926705,"d":"4348926705.00"},{"v":2364879075,"d":"2364879075.00"},"L",{"v":22000,"d":"22000.00"},"hexagon","Foreign",{"$nulls":13},{"v":1,"d":"1.00"}]
[22,"航天云网",null,"航天云网",null,"航天云网科技发展有限责任公司",{"$nulls":3},"S",{"v":99,"d":"99.00"},"qichacha","Beijing",{"$nulls":6},{"v":1,"d":"1.00"},{"v":1,"d":"1.00"},{"$nulls":18},{"v":1,"d":"1.00"},{"$nulls":48},{"v":1,"d":"1.00"},{"v":1,"d":"1.00"},{"v":1,"d":"1.00"},{"v":1,"d":"1.00"},{"v":1,"d":"1.00"},{"$nulls":6},{"v":1,"d":"1.00"},{"v":1,"d":"1.00"},{"v":1,"d":"1.00"},{"v":1,"d":"1.00"},{"v":1,"d":"1.00"},{"v":1,"d":"1.00"},{"v":1,"d":"1.00"},null,null,{"v":1,"d":"1.00"},{"v":1,"d":"1.00"},{"v":1,"d":"1.00"},{"v":1,"d":"1.00"},null,{"v":1,"d":"1.00"},{"v":1,"d":"1.00"},null,null,{"v":1,"d":"1.00"},{"v":1,"d":"1.00"},{"v":1,"d":"1.00"}]
[23,"和利时","US","和利时","HOLI","和利时科技集团有限公司",2021,{"v":10365469659.9,"d":"10365469659.90"},{"v":4857504838.2,"d":"4857504838.20"},"S",{"v":63,"d":"63.00"},"hollysys","Beijing",{"$nulls":3},{"v":1,"d":"1.00"},{"$nulls":17},{"v":1,"d":"1.00"},{"v":1,"d":"1.00"},{"v":1,"d":"1.00"},{"v":1,"d":"1.00"},{"$nulls":23},{"v":1,"d":"1.00"},{"$nulls":42},{"v":1,"d":"1.00"},{"$nulls":12},{"v":1,"d":"1.00"},{"v":1,"d":"1.00"},{"v":1,"d":"1.00"}]
[24,"华大电子","HK","华大电子","85","北京中电华大电子设计有限责任公司",2021,{"v":2486434448,"d":"2486434448.00"},{"v":1471783580.8,"d":"1471783580.80"},"M",{"v":272,"d":"272.00"},"hkexnews","Beijing",null,null,{"v":1,"d":"1.00"}]
[25,"华大九天","SZ","华大九天",{"$f":"VLOOKUP($D27,[1]Sheet1!$A$1:$M$5087,2,FALSE)","v":"301269.SZ"},{"$f":"VLOOKUP($D27,[1]Sheet1!$A$1:$M$5087,9,FALSE)","v":"北京华大九天科技股份有限公司"},2021,{"v":1802000000,"d":"1802000000.00"},{"v":579000000,"d":"579000000.00"},"L",{"v":660,"d":"660.00"},"qichacha","Beijing",{"$nulls":17},{"v":1,"d":"1.00"}]
[26,"寄云科技",null,"寄云科技",null,"北京寄云科技有限公司",{"$nulls":3},"XS",{"v":2,"d":"2.00"},null,"Beijing",{"$nulls":86},{"v":1,"d":"1.00"},{"v":1,"d":"1.00"},{"v":1,"d":"1.00"},{"v":1,"d":"1.00"},{"v":1,"d":"1.00"},{"v":1,"d":"1.00"},{"v":1,"d":"1.00"}]
[27,"江南天安",null,"江南天安",null,"北京江南天安科技有限公司",{"$nulls":3},"M",{"v":192,"d":"192.00"},"qichacha","Beijing",{"$nulls":58},{"v":1,"d":"1.00"}]
[28,"金山云","HK","金山云","3896","北京金山云网络技术有限公司",2021,{"v":19000334000,"d":"19000334000.00"},{"v":4080307000,"d":"4080307000.00"},"L",{"v":1315,"d":"1315.00"},"hkexnews","Beijing",{"$nulls":102},{"v":1,"d":"1.00"}]
{"$rows_left_out":143}
{"sheet":"Firm_ori","index":1,"n_rows":171,"n_cols":118,"rows_kept":171}
["Code","Name","Stock","Stock_Name","Stock_Code","Chinese_Name","Assets","Revenue","Size","Num_Employ","Type_Region",1,1.1,"1.1.1","1.1.2","1.1.3",1.2,"1.2.1","1.2.2","1.2.3",1.3,"1.3.1","1.3.1.1","1.3.1.2","1.3.1.3","1.3.1.4","1.3.1.5","1.3.1.6","1.3.1.7","1.3.2","1.3.2.1","1.3.3","1.3.3.1","1.3.3.2","1.3.3.3","1.3.3.4","1.3.3.5","1.3.3.6","1.3.3.7","1.3.4","1.3.4.1","1.3.4.2","1.3.4.3","1.3.5","1.3.5.1",1.4,"1.4.1","1.4.1.1","1.4.1.2","1.4.1.3","1.4.1.4","1.4.1.5","1.4.2","1.4.2.1","1.4.2.2","1.4.2.3","1.4.2.4","1.4.2.5","1.4.2.6","1.4.2.7","1.4.3","1.4.3.1","1.4.3.2","1.4.3.3","1.4.3.4","1.4.3.5","1.4.3.6","1.4.4","1.4.4.1","1.4.4.2","1.4.4.3","1.4.4.4","1.4.4.5","1.4.5","1.4.5.1","1.4.5.2","1.4.5.3","1.4.5.4","1.4.5.5","1.4.5.6","1.4.5.7","1.4.5.8","1.4.5.9",2,2.1,"2.1.1","2.1.1.1","2.1.1.2","2.1.1.3","2.1.1.4","2.1.1.5","2.1.2","2.1.2.1","2.1.2.2","2.1.2.3","2.1.2.4","2.1.3","2.1.3.1","2.1.3.2","2.1.3.3","2.1.3.4","2.1.3.5","2.1.3.6","2.1.3.7","2.1.4","2.1.4.1","2.1.4.1.1","2.1.4.1.2","2.1.4.1.3","2.1.4.1.4","2.1.4.2","2.1.4.2.1","2.1.4.2.2",2.2,2.3,"2.3.1","2.3.2","2.3.3"]
[0,"360科技","SH","三六零",{"$f":"VLOOKUP($D2,[1]Sheet1!$A$1:$M$5087,2,FALSE)","v":"601360.SH"},{"$f":"VLOOKUP($D2,[1]Sheet1!$A$1:$M$5087,9,FALSE)","v":"三六零安全科技股份有限公司"},{"$f":"VLOOKUP($D2,[1]Sheet1!$A$1:$M$5087,12,FALSE)","v":{"v":1434515000,"d":"1434515000.00"}},{"$f":"VLOOKUP($D2,[1]Sheet1!$A$1:$M$5087,13,FALSE)","v":{"v":6934554000,"d":"6934554000.00"}},null,null,"Beijing",{"$nulls":57},1]
[15,"东软集团","SH","东软集团",{"$f":"VLOOKUP($D3,[1]Sheet1!$A$1:$M$5087,2,FALSE)","v":"600718.SH"},{"$f":"VLOOKUP($D3,[1]Sheet1!$A$1:$M$5087,9,FALSE)","v":"东软集团股份有限公司"},{"$f":"VLOOKUP($D3,[1]Sheet1!$A$1:$M$5087,12,FALSE)","v":{"v":1457377629,"d":"1457377629.00"}},{"$f":"VLOOKUP($D3,[1]Sheet1!$A$1:$M$5087,13,FALSE)","v":{"v":5563998301,"d":"5563998301.00"}},null,null,"Beijing",{"$nulls":25},1]
[36,"龙芯中科","SH","龙芯中科",{"$f":"VLOOKUP($D4,[1]Sheet1!$A$1:$M$5087,2,FALSE)","v":"688047.SH"},{"$f":"VLOOKUP($D4,[1]Sheet1!$A$1:$M$5087,9,FALSE)","v":"龙芯中科技术股份有限公司"},{"$f":"VLOOKUP($D4,[1]Sheet1!$A$1:$M$5087,12,FALSE)","v":322896998.78},{"$f":"VLOOKUP($D4,[1]Sheet1!$A$1:$M$5087,13,FALSE)","v":483762764.25},null,null,"Beijing",null,null,1]
[40,"奇安信","SH","奇安信",{"$f":"VLOOKUP($D5,[1]Sheet1!$A$1:$M$5087,2,FALSE)","v":"688561.SH"},{"$f":"VLOOKUP($D5,[1]Sheet1!$A$1:$M$5087,9,FALSE)","v":"奇安信科技集团股份有限公司"},{"$f":"VLOOKUP($D5,[1]Sheet1!$A$1:$M$5087,12,FALSE)","v":1253992862.02},{"$f":"VLOOKUP($D5,[1]Sheet1!$A$1:$M$5087,13,FALSE)","v":3191684379.05},null,null,"Beijing",{"$nulls":42},1,{"$nulls":3},1,{"$nulls":5},1,{"$nulls":8},1]
[58,"用友","SH","用友网络",{"$f":"VLOOKUP($D6,[1]Sheet1!$A$1:$M$5087,2,FALSE)","v":"600588.SH"},{"$f":"VLOOKUP($D6,[1]Sheet1!$A$1:$M$5087,9,FALSE)","v":"用友网络科技股份有限公司"},{"$f":"VLOOKUP($D6,[1]Sheet1!$A$1:$M$5087,12,FALSE)","v":{"v":2399600668,"d":"2399600668.00"}},{"$f":"VLOOKUP($D6,[1]Sheet1!$A$1:$M$5087,13,FALSE)","v":{"v":5595419922,"d":"5595419922.00"}},null,null,"Beijing",{"$nulls":7},1,{"$nulls":8},1,null,null,1,{"$nulls":9},1,1,1,{"$nulls":49},1,1,1,1]
[65,"中国电信","SH","中国电信",{"$f":"VLOOKUP($D7,[1]Sheet1!$A$1:$M$5087,2,FALSE)","v":"601728.SH"},{"$f":"VLOOKUP($D7,[1]Sheet1!$A$1:$M$5087,9,FALSE)","v":"中国电信股份有限公司"},{"$f":"VLOOKUP($D7,[1]Sheet1!$A$1:$M$5087,12,FALSE)","v":{"v":396133457989.2,"d":"396133457989.20"}},{"$f":"VLOOKUP($D7,[1]Sheet1!$A$1:$M$5087,13,FALSE)","v":357842938040.33},null,null,"Beijing",{"$nulls":6},1]
[66,"中国联通","SH","中国联通",{"$f":"VLOOKUP($D8,[1]Sheet1!$A$1:$M$5087,2,FALSE)","v":"600050.SH"},{"$f":"VLOOKUP($D8,[1]Sheet1!$A$1:$M$5087,9,FALSE)","v":"中国联合网络通信股份有限公司"},{"$f":"VLOOKUP($D8,[1]Sheet1!$A$1:$M$5087,12,FALSE)","v":{"v":292689580511,"d":"292689580511.00"}},{"$f":"VLOOKUP($D8,[1]Sheet1!$A$1:$M$5087,13,FALSE)","v":{"v":263977913122,"d":"263977913122.00"}},null,null,"Beijing",{"$nulls":6},1]
[67,"中国移动","SH","中国移动",{"$f":"VLOOKUP($D9,[1]Sheet1!$A$1:$M$5087,2,FALSE)","v":"600941.SH"},{"$f":"VLOOKUP($D9,[1]Sheet1!$A$1:$M$5087,9,FALSE)","v":"中国移动有限公司"},{"$f":"VLOOKUP($D9,[1]Sheet1!$A$1:$M$5087,12,FALSE)","v":{"v":704445000000,"d":"704445000000.00"}},{"$f":"VLOOKUP($D9,[1]Sheet1!$A$1:$M$5087,13,FALSE)","v":{"v":723487000000,"d":"723487000000.00"}},null,null,"Beijing",{"$nulls":6},1]
[68,"中望软件","SH","中望软件",{"$f":"VLOOKUP($D10,[1]Sheet1!$A$1:$M$5087,2,FALSE)","v":"688083.SH"},{"$f":"VLOOKUP($D10,[1]Sheet1!$A$1:$M$5087,9,FALSE)","v":"广州中望龙腾软件股份有限公司"},{"$f":"VLOOKUP($D10,[1]Sheet1!$A$1:$M$5087,12,FALSE)","v":70419698.72},{"$f":"VLOOKUP($D10,[1]Sheet1!$A$1:$M$5087,13,FALSE)","v":349648105.59},null,null,"Beijing",{"$nulls":11},1,1,1]
[107,"安恒信息","SH","安恒信息",{"$f":"VLOOKUP($D11,[1]Sheet1!$A$1:$M$5087,2,FALSE)","v":"688023.SH"},{"$f":"VLOOKUP($D11,[1]Sheet1!$A$1:$M$5087,9,FALSE)","v":"杭州安恒信息技术股份有限公司"},{"$f":"VLOOKUP($D11,[1]Sheet1!$A$1:$M$5087,12,FALSE)","v":462850454.39},{"$f":"VLOOKUP($D11,[1]Sheet1!$A$1:$M$5087,13,FALSE)","v":{"v":1039606301.4,"d":"1039606301.40"}},null,null,"Non_Beijing",{"$nulls":52},1]
[109,"宝信软件","SH","宝信软件",{"$f":"VLOOKUP($D12,[1]Sheet1!$A$1:$M$5087,2,FALSE)","v":"600845.SH"},{"$f":"VLOOKUP($D12,[1]Sheet1!$A$1:$M$5087,9,FALSE)","v":"上海宝信软件股份有限公司"},{"$f":"VLOOKUP($D12,[1]Sheet1!$A$1:$M$5087,12,FALSE)","v":1482389060.03},{"$f":"VLOOKUP($D12,[1]Sheet1!$A$1:$M$5087,13,FALSE)","v":7653052582.24},null,null,"Non_Beijing",{"$nulls":21},1]
[116,"概伦电子","SH","概伦电子",{"$f":"VLOOKUP($D13,[1]Sheet1!$A$1:$M$5087,2,FALSE)","v":"688206.SH"},{"$f":"VLOOKUP($D13,[1]Sheet1!$A$1:$M$5087,9,FALSE)","v":"上海概伦电子股份有限公司"},{"$f":"VLOOKUP($D13,[1]Sheet1!$A$1:$M$5087,12,FALSE)","v":57620615.86},{"$f":"VLOOKUP($D13,[1]Sheet1!$A$1:$M$5087,13,FALSE)","v":170710609.25},null,null,"Non_Beijing",{"$nulls":17},1]
[124,"海尔","SH","海尔智家",{"$f":"VLOOKUP($D14,[1]Sheet1!$A$1:$M$5087,2,FALSE)","v":"600690.SH"},{"$f":"VLOOKUP($D14,[1]Sheet1!$A$1:$M$5087,9,FALSE)","v":"海尔智家股份有限公司"},{"$f":"VLOOKUP($D14,[1]Sheet1!$A$1:$M$5087,12,FALSE)","v":{"v":24514888907.2,"d":"24514888907.20"}},{"$f":"VLOOKUP($D14,[1]Sheet1!$A$1:$M$5087,13,FALSE)","v":{"v":184748766010.1,"d":"184748766010.10"}},null,null,"Non_Beijing",{"$nulls":6},1,{"$nulls":97},1,1,1]
[135,"浪潮","SH","浪潮软件",{"$f":"VLOOKUP($D15,[1]Sheet1!$A$1:$M$5087,2,FALSE)","v":"600756.SH"},{"$f":"VLOOKUP($D15,[1]Sheet1!$A$1:$M$5087,9,FALSE)","v":"浪潮软件股份有限公司"},{"$f":"VLOOKUP($D15,[1]Sheet1!$A$1:$M$5087,12,FALSE)","v":77633905.16},{"$f":"VLOOKUP($D15,[1]Sheet1!$A$1:$M$5087,13,FALSE)","v":1195061071.36},null,null,"Non_Beijing",{"$nulls":4},1,{"$nulls":14},1,{"$nulls":9},1,{"$nulls":56},1,1,1,1,1,1,1,{"$nulls":9},1]
[139,"容知日新","SH","容知日新",{"$f":"VLOOKUP($D16,[1]Sheet1!$A$1:$M$5087,2,FALSE)","v":"688768.SH"},{"$f":"VLOOKUP($D16,[1]Sheet1!$A$1:$M$5087,9,FALSE)","v":"安徽容知日新科技股份有限公司"},{"$f":"VLOOKUP($D16,[1]Sheet1!$A$1:$M$5087,12,FALSE)","v":45702157.19},{"$f":"VLOOKUP($D16,[1]Sheet1!$A$1:$M$5087,13,FALSE)","v":{"v":322612395.1,"d":"322612395.10"}},null,null,"Non_Beijing",{"$nulls":27},1]
[140,"山石网科","SH","山石网科",{"$f":"VLOOKUP($D17,[1]Sheet1!$A$1:$M$5087,2,FALSE)","v":"688030.SH"},{"$f":"VLOOKUP($D17,[1]Sheet1!$A$1:$M$5087,9,FALSE)","v":"山石网科通信技术股份有限公司"},{"$f":"VLOOKUP($D17,[1]Sheet1!$A$1:$M$5087,12,FALSE)","v":260450629.24},{"$f":"VLOOKUP($D17,[1]Sheet1!$A$1:$M$5087,13,FALSE)","v":713733934.37},null,null,"Non_Beijing",{"$nulls":36},1,null,null,1,1,{"$nulls":22},1,null,1,1,{"$nulls":4},1]
[150,"唯捷创芯","SH","唯捷创芯",{"$f":"VLOOKUP($D18,[1]Sheet1!$A$1:$M$5087,2,FALSE)","v":"688153.SH"},{"$f":"VLOOKUP($D18,[1]Sheet1!$A$1:$M$5087,9,FALSE)","v":"唯捷创芯(天津)电子技术股份有限公司"},{"$f":"VLOOKUP($D18,[1]Sheet1!$A$1:$M$5087,12,FALSE)","v":276223596.85},{"$f":"VLOOKUP($D18,[1]Sheet1!$A$1:$M$5087,13,FALSE)","v":1777497364.85},null,null,"Non_Beijing",null,null,1]
[168,"中控技术","SH","中控技术",{"$f":"VLOOKUP($D19,[1]Sheet1!$A$1:$M$5087,2,FALSE)","v":"688777.SH"},{"$f":"VLOOKUP($D19,[1]Sheet1!$A$1:$M$5087,9,FALSE)","v":"浙江中控技术股份有限公司"},{"$f":"VLOOKUP($D19,[1]Sheet1!$A$1:$M$5087,12,FALSE)","v":294025037.46},{"$f":"VLOOKUP($D19,[1]Sheet1!$A$1:$M$5087,13,FALSE)","v":4226806480.55},null,null,"Non_Beijing",{"$nulls":3},1,{"$nulls":17},1,1,null,1,{"$nulls":79},1,1,1]
[169,"中芯国际","SH","中芯国际",{"$f":"VLOOKUP($D20,[1]Sheet1!$A$1:$M$5087,2,FALSE)","v":"688981.SH"},{"$f":"VLOOKUP($D20,[1]Sheet1!$A$1:$M$5087,9,FALSE)","v":"中芯国际集成电路制造有限公司"},{"$f":"VLOOKUP($D20,[1]Sheet1!$A$1:$M$5087,12,FALSE)","v":{"v":80504741000,"d":"80504741000.00"}},{"$f":"VLOOKUP($D20,[1]Sheet1!$A$1:$M$5087,13,FALSE)","v":{"v":37763559000,"d":"37763559000.00"}},null,null,"Non_Beijing",null,null,1]
[11,"北信源","SZ","北信源",{"$f":"VLOOKUP($D21,[1]Sheet1!$A$1:$M$5087,2,FALSE)","v":"300352.SZ"},{"$f":"VLOOKUP($D21,[1]Sheet1!$A$1:$M$5087,9,FALSE)","v":"北京北信源软件股份有限公司"},{"$f":"VLOOKUP($D21,[1]Sheet1!$A$1:$M$5087,12,FALSE)","v":77074388.63},{"$f":"VLOOKUP($D21,[1]Sheet1!$A$1:$M$5087,13,FALSE)","v":464684362.74},null,null,"Beijing",{"$nulls":58},1]
[13,"东方国信","SZ","东方国信",{"$f":"VLOOKUP($D22,[1]Sheet1!$A$1:$M$5087,2,FALSE)","v":"300166.SZ"},{"$f":"VLOOKUP($D22,[1]Sheet1!$A$1:$M$5087,9,FALSE)","v":"北京东方国信科技股份有限公司"},{"$f":"VLOOKUP($D22,[1]Sheet1!$A$1:$M$5087,12,FALSE)","v":520633500.11},{"$f":"VLOOKUP($D22,[1]Sheet1!$A$1:$M$5087,13,FALSE)","v":1424966264.96},null,null,"Beijing",{"$nulls":7},1,{"$nulls":78},1,1,1,1,1,1,1,null,null,1,1,1,1,null,1,1,null,null,1,1,1]
[14,"东华软件","SZ","东华软件",{"$f":"VLOOKUP($D23,[1]Sheet1!$A$1:$M$5087,2,FALSE)","v":"002065.SZ"},{"$f":"VLOOKUP($D23,[1]Sheet1!$A$1:$M$5087,9,FALSE)","v":"东华软件股份公司"},{"$f":"VLOOKUP($D23,[1]Sheet1!$A$1:$M$5087,12,FALSE)","v":{"v":373161892.9,"d":"373161892.90"}},{"$f":"VLOOKUP($D23,[1]Sheet1!$A$1:$M$5087,13,FALSE)","v":7320357215.14},null,null,"Beijing",{"$nulls":24},1,{"$nulls":6},1]
[16,"东土科技","SZ","东土科技",{"$f":"VLOOKUP($D24,[1]Sheet1!$A$1:$M$5087,2,FALSE)","v":"300353.SZ"},{"$f":"VLOOKUP($D24,[1]Sheet1!$A$1:$M$5087,9,FALSE)","v":"北京东土科技股份有限公司"},{"$f":"VLOOKUP($D24,[1]Sheet1!$A$1:$M$5087,12,FALSE)","v":354573374.85},{"$f":"VLOOKUP($D24,[1]Sheet1!$A$1:$M$5087,13,FALSE)","v":581446025.63},null,null,"Beijing",{"$nulls":4},1,{"$nulls":99},1,1,1]
[25,"华大九天","SZ","华大九天",{"$f":"VLOOKUP($D25,[1]Sheet1!$A$1:$M$5087,2,FALSE)","v":"301269.SZ"},{"$f":"VLOOKUP($D25,[1]Sheet1!$A$1:$M$5087,9,FALSE)","v":"北京华大九天科技股份有限公司"},{"$f":"VLOOKUP($D25,[1]Sheet1!$A$1:$M$5087,12,FALSE)","v":{"v":490785437,"d":"490785437.00"}},{"$f":"VLOOKUP($D25,[1]Sheet1!$A$1:$M$5087,13,FALSE)","v":482790475.98},null,null,"Beijing",{"$nulls":17},1]
[37,"绿盟","SZ","绿盟科技",{"$f":"VLOOKUP($D26,[1]Sheet1!$A$1:$M$5087,2,FALSE)","v":"300369.SZ"},{"$f":"VLOOKUP($D26,[1]Sheet1!$A$1:$M$5087,9,FALSE)","v":"绿盟科技集团股份有限公司"},{"$f":"VLOOKUP($D26,[1]Sheet1!$A$1:$M$5087,12,FALSE)","v":262092897.51},{"$f":"VLOOKUP($D26,[1]Sheet1!$A$1:$M$5087,13,FALSE)","v":1387715116.74},null,null,"Beijing",{"$nulls":37},1,null,1,{"$nulls":3},1,{"$nulls":6},1,{"$nulls":8},1,{"$nulls":4},1]
[41,"启明星辰","SZ","启明星辰",{"$f":"VLOOKUP($D27,[1]Sheet1!$A$1:$M$5087,2,FALSE)","v":"002439.SZ"},{"$f":"VLOOKUP($D27,[1]Sheet1!$A$1:$M$5087,9,FALSE)","v":"启明星辰信息技术集团股份有限公司"},{"$f":"VLOOKUP($D27,[1]Sheet1!$A$1:$M$5087,12,FALSE)","v":670772838.93},{"$f":"VLOOKUP($D27,[1]Sheet1!$A$1:$M$5087,13,FALSE)","v":2168371071.21},null,null,"Beijing",{"$nulls":37},1,null,null,1,{"$nulls":9},1,1,null,1,1,{"$nulls":8},1,1,{"$nulls":5},1]
[53,"天融信","SZ","天融信",{"$f":"VLOOKUP($D28,[1]Sheet1!$A$1:$M$5087,2,FALSE)","v":"002212.SZ"},{"$f":"VLOOKUP($D28,[1]Sheet1!$A$1:$M$5087,9,FALSE)","v":"天融信科技集团股份有限公司"},{"$f":"VLOOKUP($D28,[1]Sheet1!$A$1:$M$5087,12,FALSE)","v":{"v":410157887.2,"d":"410157887.20"}},{"$f":"VLOOKUP($D28,[1]Sheet1!$A$1:$M$5087,13,FALSE)","v":1463262268.45},null,null,"Beijing",{"$nulls":38},1,1,1,{"$nulls":3},1,1,{"$nulls":6},1,1,1,1,{"$nulls":4},1,{"$nulls":3},1,1,null,null,1,1,1]
[69,"紫光集团","SZ","紫光股份",{"$f":"VLOOKUP($D29,[1]Sheet1!$A$1:$M$5087,2,FALSE)","v":"000938.SZ"},{"$f":"VLOOKUP($D29,[1]Sheet1!$A$1:$M$5087,9,FALSE)","v":"紫光股份有限公司"},{"$f":"VLOOKUP($D29,[1]Sheet1!$A$1:$M$5087,12,FALSE)","v":{"v":998745868.8,"d":"998745868.80"}},{"$f":"VLOOKUP($D29,[1]Sheet1!$A$1:$M$5087,13,FALSE)","v":53889951078.17},null,null,"Beijing",null,null,1]
[111,"鼎捷软件","SZ","鼎捷软件",{"$f":"VLOOKUP($D30,[1]Sheet1!$A$1:$M$5087,2,FALSE)","v":"300378.SZ"},{"$f":"VLOOKUP($D30,[1]Sheet1!$A$1:$M$5087,9,FALSE)","v":"鼎捷软件股份有限公司"},{"$f":"VLOOKUP($D30,[1]Sheet1!$A$1:$M$5087,12,FALSE)","v":715393050.95},{"$f":"VLOOKUP($D30,[1]Sheet1!$A$1:$M$5087,13,FALSE)","v":1278827820.91},null,null,"Non_Beijing",{"$nulls":16},1,{"$nulls":4},1,{"$nulls":7},1]
{"$rows_left_out":142}
{"sheet":"Sheet1","index":2,"n_rows":4,"n_cols":3,"rows_kept":4}
["类型","数据来源","汇率"]
["中国","https://www.qcc.com/",1]
["港股上市"]
["美股上市","https://finance.sina.com.cn/stock/usstock/\nhttps://cn.bing.com/","SEK 1.53"]